Reaction Details
TargetcAMP-specific 3',5'-cyclic phosphodiesterase 4D
LigandBDBM50085134
Substrate/Competitorn/a
Meas. Tech.ChEMBL_155180 (CHEMBL761827)
IC50 2000±n/a nM
Citation Hersperger, RBray-French, KMazzoni, LMüller, T Palladium-catalyzed cross-coupling reactions for the synthesis of 6, 8-disubstituted 1,7-naphthyridines: a novel class of potent and selective phosphodiesterase type 4D inhibitors. J Med Chem43:675-82 (2000) cAMP-specific 3',5'-cyclic phosphodiesterase 4D
Name:cAMP-specific 3',5'-cyclic phosphodiesterase 4D
Type:Protein
Mol. Mass.:91092.69
Organism:Homo sapiens (Human)
Description:Q08499
Residue:809
BDBM50085134
NameBDBM50085134
Synonyms:(4-Methyl-piperazin-1-yl)-[8-(3-nitro-phenyl)-[1,7]naphthyridin-6-yl]-methanone | CHEMBL161602
TypeSmall organic molecule
Emp. Form.C20H19N5O3
Mol. Mass.377.3966
SMILESCN1CCN(CC1)C(=O)c1cc2cccnc2c(n1)-c1cccc(c1)[N+]([O-])=O