Reaction Details
TargetcAMP-specific 3',5'-cyclic phosphodiesterase 4B
LigandBDBM50085136
Substrate/Competitorn/a
Meas. Tech.ChEMBL_155173 (CHEMBL761911)
IC50 110±n/a nM
Citation Hersperger, RBray-French, KMazzoni, LMüller, T Palladium-catalyzed cross-coupling reactions for the synthesis of 6, 8-disubstituted 1,7-naphthyridines: a novel class of potent and selective phosphodiesterase type 4D inhibitors. J Med Chem43:675-82 (2000) cAMP-specific 3',5'-cyclic phosphodiesterase 4B
Name:cAMP-specific 3',5'-cyclic phosphodiesterase 4B
Type:Enzyme Catalytic Domain
Mol. Mass.:83349.50
Organism:RAT
Description:P14646
Residue:736
BDBM50085136
NameBDBM50085136
Synonyms:8-(3-Nitro-phenyl)-6-phenyl-[1,7]naphthyridine | CHEMBL161465
TypeSmall organic molecule
Emp. Form.C20H13N3O2
Mol. Mass.327.3361
SMILES[O-][N+](=O)c1cccc(c1)-c1nc(cc2cccnc12)-c1ccccc1