Reaction Details
TargetcAMP-specific 3',5'-cyclic phosphodiesterase 4B
LigandBDBM50085138
Substrate/Competitorn/a
Meas. Tech.ChEMBL_155173 (CHEMBL761911)
IC50 45±n/a nM
Citation Hersperger, RBray-French, KMazzoni, LMüller, T Palladium-catalyzed cross-coupling reactions for the synthesis of 6, 8-disubstituted 1,7-naphthyridines: a novel class of potent and selective phosphodiesterase type 4D inhibitors. J Med Chem43:675-82 (2000) cAMP-specific 3',5'-cyclic phosphodiesterase 4B
Name:cAMP-specific 3',5'-cyclic phosphodiesterase 4B
Type:Enzyme Catalytic Domain
Mol. Mass.:83349.50
Organism:RAT
Description:P14646
Residue:736
BDBM50085138
NameBDBM50085138
Synonyms:4-[8-(3-Chloro-phenyl)-[1,7]naphthyridin-6-yl]-benzoic acid | CHEMBL161115
TypeSmall organic molecule
Emp. Form.C21H13ClN2O2
Mol. Mass.360.793
SMILESOC(=O)c1ccc(cc1)-c1cc2cccnc2c(n1)-c1cccc(Cl)c1