Reaction Details
TargetcAMP-specific 3',5'-cyclic phosphodiesterase 4C
LigandBDBM50085146
Substrate/Competitorn/a
Meas. Tech.ChEMBL_155176 (CHEMBL761823)
IC50 610±n/a nM
Citation Hersperger, RBray-French, KMazzoni, LMüller, T Palladium-catalyzed cross-coupling reactions for the synthesis of 6, 8-disubstituted 1,7-naphthyridines: a novel class of potent and selective phosphodiesterase type 4D inhibitors. J Med Chem43:675-82 (2000) cAMP-specific 3',5'-cyclic phosphodiesterase 4C
Name:cAMP-specific 3',5'-cyclic phosphodiesterase 4C
Type:Enzyme Catalytic Domain
Mol. Mass.:79875.54
Organism:Homo sapiens (Human)
Description:Q08493
Residue:712
BDBM50085146
NameBDBM50085146
Synonyms:8-(3-Nitro-phenyl)-6-pyridin-3-yl-[1,7]naphthyridine | CHEMBL351613
TypeSmall organic molecule
Emp. Form.C19H12N4O2
Mol. Mass.328.3242
SMILES[O-][N+](=O)c1cccc(c1)-c1nc(cc2cccnc12)-c1cccnc1