Reaction Details
TargetcAMP-specific 3',5'-cyclic phosphodiesterase 4A
LigandBDBM50085147
Substrate/Competitorn/a
Meas. Tech.ChEMBL_155033 (CHEMBL765475)
IC50 3800±n/a nM
Citation Hersperger, RBray-French, KMazzoni, LMüller, T Palladium-catalyzed cross-coupling reactions for the synthesis of 6, 8-disubstituted 1,7-naphthyridines: a novel class of potent and selective phosphodiesterase type 4D inhibitors. J Med Chem43:675-82 (2000) cAMP-specific 3',5'-cyclic phosphodiesterase 4A
Name:cAMP-specific 3',5'-cyclic phosphodiesterase 4A
Type:Enzyme
Mol. Mass.:98113.27
Organism:Homo sapiens (Human)
Description:P27815
Residue:886
BDBM50085147
NameBDBM50085147
Synonyms:8-(3-Nitro-phenyl)-6-o-tolyl-[1,7]naphthyridine | CHEMBL345360
TypeSmall organic molecule
Emp. Form.C21H15N3O2
Mol. Mass.341.3627
SMILESCc1ccccc1-c1cc2cccnc2c(n1)-c1cccc(c1)[N+]([O-])=O