Reaction Details
TargetPolyunsaturated fatty acid 5-lipoxygenase
LigandBDBM50085160
Substrate/Competitorn/a
Meas. Tech.ChEMBL_86312 (CHEMBL696464)
IC50 7±n/a nM
Citation Kolasa, TGunn, DEBhatia, PWoods, KWGane, TStewart, AOBouska, JBHarris, RRHulkower, KIMalo, PEBell, RLCarter, GWBrooks, CD Heteroarylmethoxyphenylalkoxyiminoalkylcarboxylic acids as leukotriene biosynthesis inhibitors. J Med Chem43:690-705 (2000) Polyunsaturated fatty acid 5-lipoxygenase
Name:Polyunsaturated fatty acid 5-lipoxygenase
Type:Enzyme
Mol. Mass.:77972.74
Organism:Homo sapiens (Human)
Description:Recombinant protein was purified from E. coli lysate. After ammonium sulfate precipitation and subsequent steps, the supernatant (S100) was used for 5-LO activity assay.
Residue:674
BDBM50085160
NameBDBM50085160
Synonyms:CHEMBL32842 {4-(4-Chloro-phenyl)-1-[4-(quinolin-2-ylmethoxy)-phenyl]-butylsulfanyl}-acetic acid
TypeSmall organic molecule
Emp. Form.C28H26ClNO3S
Mol. Mass.492.029
SMILESOC(=O)CSC(CCCc1ccc(Cl)cc1)c1ccc(OCc2ccc3ccccc3n2)cc1