Reaction Details
TargetP2Y purinoceptor 1
LigandBDBM50085820
Substrate/Competitorn/a
Meas. Tech.ChEMBL_147720 (CHEMBL759190)
EC50 37000±n/a nM
Citation Nandanan, EJang, SYMoro, SKim, HOSiddiqui, MARuss, PMarquez, VEBusson, RHerdewijn, PHarden, TKBoyer, JLJacobson, KA Synthesis, biological activity, and molecular modeling of ribose-modified deoxyadenosine bisphosphate analogues as P2Y(1) receptor ligands. J Med Chem43:829-42 (2000) P2Y purinoceptor 1
Name:P2Y purinoceptor 1
Type:n/a
Mol. Mass.:41199.64
Organism:Meleagris gallopavo
Description:n/a
Residue:362
BDBM50085820
NameBDBM50085820
Synonyms:CHEMBL352431 | {2-[2-(6-Amino-purin-9-yl)-6-phosphonooxymethyl-morpholin-4-yl]-ethyl}-phosphonic acid
TypeSmall organic molecule
Emp. Form.C12H20N6O8P2
Mol. Mass.438.2701
SMILESNc1ncnc2n(cnc12)C1CN(CCP(O)(O)=O)CC(COP(O)(O)=O)O1