Reaction Details
TargetP2Y purinoceptor 1
LigandBDBM50085824
Substrate/Competitorn/a
Meas. Tech.ChEMBL_222620 (CHEMBL846295)
IC50 805±n/a nM
Citation Nandanan, EJang, SYMoro, SKim, HOSiddiqui, MARuss, PMarquez, VEBusson, RHerdewijn, PHarden, TKBoyer, JLJacobson, KA Synthesis, biological activity, and molecular modeling of ribose-modified deoxyadenosine bisphosphate analogues as P2Y(1) receptor ligands. J Med Chem43:829-42 (2000) P2Y purinoceptor 1
Name:P2Y purinoceptor 1
Type:n/a
Mol. Mass.:41199.64
Organism:Meleagris gallopavo
Description:n/a
Residue:362
BDBM50085824
NameBDBM50085824
Synonyms:CHEMBL352744 | Phosphoric acid mono-[3-(2-chloro-6-methylamino-purin-9-yl)-2-phosphonooxymethyl-cyclobutyl] ester
TypeSmall organic molecule
Emp. Form.C11H16ClN5O8P2
Mol. Mass.443.674
SMILESCNc1nc(Cl)nc2n(cnc12)[C@@H]1C[C@H](OP(O)(O)=O)C1COP(O)(O)=O