Reaction Details
TargetMelatonin receptor type 1B
LigandBDBM50086000
Substrate/Competitorn/a
Meas. Tech.ChEMBL_105265 (CHEMBL872558)
Ki 21.9±n/a nM
Citation Faust, RGarratt, PJJones, RYeh, LKTsotinis, APanoussopoulou, MCalogeropoulou, TTeh, MTSugden, D Mapping the melatonin receptor. 6. Melatonin agonists and antagonists derived from 6H-isoindolo[2,1-a]indoles, 5,6-dihydroindolo[2,1-a]isoquinolines, and 6,7-dihydro-5H-benzo[c]azepino[2,1-a]indoles. J Med Chem43:1050-61 (2000) Melatonin receptor type 1B
Name:Melatonin receptor type 1B
Type:Enzyme
Mol. Mass.:40203.54
Organism:Homo sapiens (Human)
Description:P49286
Residue:362
BDBM50086000
NameBDBM50086000
Synonyms:CHEMBL276005 | N-[2-(11-Ethoxy-6,7-dihydro-5H-benzo[3,4]azepino[1,2-a]indol-13-yl)-ethyl]-propionamide
TypeSmall organic molecule
Emp. Form.C24H28N2O2
Mol. Mass.376.4913
SMILESCCOc1ccc2n3CCCc4ccccc4-c3c(CCNC(=O)CC)c2c1