Reaction Details
TargetMelatonin receptor type 1B
LigandBDBM50086026
Substrate/Competitorn/a
Meas. Tech.ChEMBL_105265 (CHEMBL872558)
Ki 5.5±n/a nM
Citation Faust, RGarratt, PJJones, RYeh, LKTsotinis, APanoussopoulou, MCalogeropoulou, TTeh, MTSugden, D Mapping the melatonin receptor. 6. Melatonin agonists and antagonists derived from 6H-isoindolo[2,1-a]indoles, 5,6-dihydroindolo[2,1-a]isoquinolines, and 6,7-dihydro-5H-benzo[c]azepino[2,1-a]indoles. J Med Chem43:1050-61 (2000) Melatonin receptor type 1B
Name:Melatonin receptor type 1B
Type:Enzyme
Mol. Mass.:40203.54
Organism:Homo sapiens (Human)
Description:P49286
Residue:362
BDBM50086026
NameBDBM50086026
Synonyms:CHEMBL9600 | Cyclopropanecarboxylic acid [2-(2-ethoxy-6H-isoindolo[2,1-a]indol-11-yl)-ethyl]-amide
TypeSmall organic molecule
Emp. Form.C23H24N2O2
Mol. Mass.360.4489
SMILESCCOc1ccc2n3Cc4ccccc4-c3c(CCNC(=O)C3CC3)c2c1