Reaction Details
TargetMelatonin receptor type 1A
LigandBDBM85065
Substrate/Competitorn/a
Meas. Tech.ChEMBL_105101 (CHEMBL715945)
Ki 603±n/a nM
Citation Faust, RGarratt, PJJones, RYeh, LKTsotinis, APanoussopoulou, MCalogeropoulou, TTeh, MTSugden, D Mapping the melatonin receptor. 6. Melatonin agonists and antagonists derived from 6H-isoindolo[2,1-a]indoles, 5,6-dihydroindolo[2,1-a]isoquinolines, and 6,7-dihydro-5H-benzo[c]azepino[2,1-a]indoles. J Med Chem43:1050-61 (2000) Melatonin receptor type 1A
Name:Melatonin receptor type 1A
Type:Enzyme
Mol. Mass.:39392.94
Organism:Homo sapiens (Human)
Description:P48039
Residue:350
BDBM85065
NameBDBM85065
Synonyms:CAS_117946-91-5 NSC_122162
TypeSmall organic molecule
Emp. Form.C19H20N2O
Mol. Mass.292.3749
SMILESCC(=O)NCCc1c(Cc2ccccc2)[nH]c2ccccc12