Reaction Details
TargetGag-Pol polyprotein [489-587]
LigandBDBM50369797
Substrate/Competitorn/a
Meas. Tech.ChEMBL_160747 (CHEMBL769061)
Ki 3±n/a nM
Citation Fairlie, DPTyndall, JDReid, RCWong, AKAbbenante, GScanlon, MJMarch, DRBergman, DAChai, CLBurkett, BA Conformational selection of inhibitors and substrates by proteolytic enzymes: implications for drug design and polypeptide processing. J Med Chem43:1271-81 (2001) Gag-Pol polyprotein [489-587]
Name:Gag-Pol polyprotein [489-587]
Type:Enzyme Subunit
Mol. Mass.:10781.16
Organism:Human immunodeficiency virus type 1
Description:P04585[489-587]
Residue:99
BDBM50369797
NameBDBM50369797
Synonyms:CHEMBL1794029
TypeSmall organic molecule
Emp. Form.C39H57N5O7
Mol. Mass.707.8992
SMILESCC[C@H](C)[C@@H]1NC(=O)[C@H](Cc2ccc(OCCCNC1=O)cc2)C(N)C[C@@H](O)[C@@H]1Cc2ccc(OCCCCC(=O)N[C@@H](C(C)C)C(=O)N1)cc2