Reaction Details
TargetDelta-type opioid receptor
LigandBDBM50087022
Substrate/Competitorn/a
Meas. Tech.ChEMBL_145493 (CHEMBL752135)
Ki 710±n/a nM
Citation Röver, SAdam, GCesura, AMGalley, GJenck, FMonsma, FJWichmann, JDautzenberg, FM High-affinity, non-peptide agonists for the ORL1 (orphanin FQ/nociceptin) receptor. J Med Chem43:1329-38 (2001) Delta-type opioid receptor
Name:Delta-type opioid receptor
Type:G Protein-Coupled Receptor (GPCR)
Mol. Mass.:40382.98
Organism:Homo sapiens (Human)
Description:Competition binding assays were carried out using membrane preparations from transfected HN9.10 cells that constitutively expressed the delta opioid receptor.
Residue:372
BDBM50087022
NameBDBM50087022
Synonyms:8-Indan-2-yl-1-phenyl-1,3,8-triaza-spiro[4.5]decan-4-one | CHEMBL28172
TypeSmall organic molecule
Emp. Form.C22H25N3O
Mol. Mass.347.4534
SMILESO=C1NCN(c2ccccc2)C11CCN(CC1)C1Cc2ccccc2C1