Reaction Details
TargetMu-type opioid receptor
LigandBDBM50087007
Substrate/Competitorn/a
Meas. Tech.ChEMBL_148233 (CHEMBL753393)
Ki 11±n/a nM
Citation Röver, SAdam, GCesura, AMGalley, GJenck, FMonsma, FJWichmann, JDautzenberg, FM High-affinity, non-peptide agonists for the ORL1 (orphanin FQ/nociceptin) receptor. J Med Chem43:1329-38 (2001) Mu-type opioid receptor
Name:Mu-type opioid receptor
Type:G Protein-Coupled Receptor (GPCR)
Mol. Mass.:44789.51
Organism:Homo sapiens (Human)
Description:P35372
Residue:400
BDBM50087007
NameBDBM50087007
Synonyms:8-(7-Chloro-1,2,3,4-tetrahydro-naphthalen-2-yl)-1-phenyl-1,3,8-triaza-spiro[4.5]decan-4-one | CHEMBL447779
TypeSmall organic molecule
Emp. Form.C23H26ClN3O
Mol. Mass.395.925
SMILESClc1ccc2CCC(Cc2c1)N1CCC2(CC1)N(CNC2=O)c1ccccc1