Reaction Details
TargetMu-type opioid receptor
LigandBDBM50087006
Substrate/Competitorn/a
Meas. Tech.ChEMBL_148233 (CHEMBL753393)
Ki 61±n/a nM
Citation Röver, SAdam, GCesura, AMGalley, GJenck, FMonsma, FJWichmann, JDautzenberg, FM High-affinity, non-peptide agonists for the ORL1 (orphanin FQ/nociceptin) receptor. J Med Chem43:1329-38 (2001) Mu-type opioid receptor
Name:Mu-type opioid receptor
Type:G Protein-Coupled Receptor (GPCR)
Mol. Mass.:44789.51
Organism:Homo sapiens (Human)
Description:P35372
Residue:400
BDBM50087006
NameBDBM50087006
Synonyms:8-(8-Chloro-1,2,3,4-tetrahydro-naphthalen-2-yl)-3-(2-oxo-2-phenyl-ethyl)-1-phenyl-1,3,8-triaza-spiro[4.5]decan-4-one | CHEMBL26483
TypeSmall organic molecule
Emp. Form.C31H32ClN3O2
Mol. Mass.514.058
SMILESClc1cccc2CCC(Cc12)N1CCC2(CC1)N(CN(CC(=O)c1ccccc1)C2=O)c1ccccc1