Reaction Details
TargetNociceptin receptor
LigandBDBM50087011
Substrate/Competitorn/a
Meas. Tech.ChEMBL_145015 (CHEMBL753711)
EC50 510±n/a nM
Citation Röver, SAdam, GCesura, AMGalley, GJenck, FMonsma, FJWichmann, JDautzenberg, FM High-affinity, non-peptide agonists for the ORL1 (orphanin FQ/nociceptin) receptor. J Med Chem43:1329-38 (2001) Nociceptin receptor
Name:Nociceptin receptor
Type:G Protein-Coupled Receptor (GPCR)
Mol. Mass.:40702.87
Organism:Homo sapiens (Human)
Description:P41146
Residue:370
BDBM50087011
NameBDBM50087011
Synonyms:8-(5-Methyl-1,2,3,4-tetrahydro-naphthalen-1-yl)-1-phenyl-1,3,8-triaza-spiro[4.5]decan-4-one | CHEMBL280827
TypeSmall organic molecule
Emp. Form.C24H29N3O
Mol. Mass.375.5066
SMILESCc1cccc2C(CCCc12)N1CCC2(CC1)N(CNC2=O)c1ccccc1