Reaction Details
TargetNociceptin receptor
LigandBDBM50087014
Substrate/Competitorn/a
Meas. Tech.ChEMBL_146107 (CHEMBL883401)
Ki 15±n/a nM
Citation Röver, SAdam, GCesura, AMGalley, GJenck, FMonsma, FJWichmann, JDautzenberg, FM High-affinity, non-peptide agonists for the ORL1 (orphanin FQ/nociceptin) receptor. J Med Chem43:1329-38 (2001) Nociceptin receptor
Name:Nociceptin receptor
Type:G Protein-Coupled Receptor (GPCR)
Mol. Mass.:40702.87
Organism:Homo sapiens (Human)
Description:P41146
Residue:370
BDBM50087014
NameBDBM50087014
Synonyms:3-Benzyl-8-(5,8-dichloro-1,2,3,4-tetrahydro-naphthalen-2-yl)-1-phenyl-1,3,8-triaza-spiro[4.5]decan-4-one | CHEMBL285377
TypeSmall organic molecule
Emp. Form.C30H31Cl2N3O
Mol. Mass.520.493
SMILESClc1ccc(Cl)c2CC(CCc12)N1CCC2(CC1)N(CN(Cc1ccccc1)C2=O)c1ccccc1