Reaction Details
TargetMu-type opioid receptor
LigandBDBM50087020
Substrate/Competitorn/a
Meas. Tech.ChEMBL_148233 (CHEMBL753393)
Ki 5.9±n/a nM
Citation Röver, SAdam, GCesura, AMGalley, GJenck, FMonsma, FJWichmann, JDautzenberg, FM High-affinity, non-peptide agonists for the ORL1 (orphanin FQ/nociceptin) receptor. J Med Chem43:1329-38 (2001) Mu-type opioid receptor
Name:Mu-type opioid receptor
Type:G Protein-Coupled Receptor (GPCR)
Mol. Mass.:44789.51
Organism:Homo sapiens (Human)
Description:P35372
Residue:400
BDBM50087020
NameBDBM50087020
Synonyms:8-(5,8-Dichloro-1,2,3,4-tetrahydro-naphthalen-2-yl)-1-phenyl-1,3,8-triaza-spiro[4.5]decan-4-one | CHEMBL283910
TypeSmall organic molecule
Emp. Form.C23H25Cl2N3O
Mol. Mass.430.37
SMILESClc1ccc(Cl)c2C[C@H](CCc12)N1CCC2(CC1)N(CNC2=O)c1ccccc1