Reaction Details
TargetNeprilysin
LigandBDBM50087100
Substrate/Competitorn/a
Meas. Tech.ChEMBL_140761 (CHEMBL748035)
Ki 2.9±n/a nM
Citation Chen, HNoble, FMothé, AMeudal, HCoric, PDanascimento, SRoques, BPGeorge, PFournié-Zaluski, MC Phosphinic derivatives as new dual enkephalin-degrading enzyme inhibitors: synthesis, biological properties, and antinociceptive activities. J Med Chem43:1398-408 (2001) Neprilysin
Name:Neprilysin
Type:Enzyme
Mol. Mass.:85570.75
Organism:Oryctolagus cuniculus (rabbit)
Description:NEP was purified to homogeneity from rabbit kidney.
Residue:750
BDBM50087100
NameBDBM50087100
Synonyms:(2S)-2-[(2S)-3-{[azaniumyl(phenyl)methyl](hydroxy)phosphoryl}-2-[(4-phenylphenyl)methyl]propanamido]propanoic acid | C-{[3-Biphenyl-4-yl-2-(1-carboxy-ethylcarbamoyl)-propyl]-hydroxy-phosphinoyl}-C-phenyl-methyl-ammonium
TypeSmall organic molecule
Emp. Form.C26H30N2O5P
Mol. Mass.481.5
SMILESC[C@H](NC(=O)[C@H](Cc1ccc(cc1)-c1ccccc1)CP(O)(=O)C([NH3+])c1ccccc1)C(O)=O