Reaction Details
TargetAminopeptidase N
LigandBDBM50087116
Substrate/Competitorn/a
Meas. Tech.ChEMBL_28885 (CHEMBL646583)
Ki 10.2±n/a nM
Citation Chen, HNoble, FMothé, AMeudal, HCoric, PDanascimento, SRoques, BPGeorge, PFournié-Zaluski, MC Phosphinic derivatives as new dual enkephalin-degrading enzyme inhibitors: synthesis, biological properties, and antinociceptive activities. J Med Chem43:1398-408 (2001) Aminopeptidase N
Name:Aminopeptidase N
Type:Protein
Mol. Mass.:108810.25
Organism:Sus scrofa (Pig)
Description:P15145
Residue:963
BDBM50087116
NameBDBM50087116
Synonyms:C-{[3-Biphenyl-4-yl-2-(1-carboxy-2-hydroxy-propylcarbamoyl)-propyl]-hydroxy-phosphinoyl}-C-phenyl-methyl-ammonium
TypeSmall organic molecule
Emp. Form.C27H32N2O6P
Mol. Mass.511.526
SMILESCC(O)[C@H](NC(=O)[C@H](Cc1ccc(cc1)-c1ccccc1)CP(O)(=O)[C@H]([NH3+])c1ccccc1)C(O)=O