Reaction Details
TargetAminopeptidase N
LigandBDBM50087090
Substrate/Competitorn/a
Meas. Tech.ChEMBL_28885 (CHEMBL646583)
Ki 10±n/a nM
Citation Chen, HNoble, FMothé, AMeudal, HCoric, PDanascimento, SRoques, BPGeorge, PFournié-Zaluski, MC Phosphinic derivatives as new dual enkephalin-degrading enzyme inhibitors: synthesis, biological properties, and antinociceptive activities. J Med Chem43:1398-408 (2001) Aminopeptidase N
Name:Aminopeptidase N
Type:Protein
Mol. Mass.:108810.25
Organism:Sus scrofa (Pig)
Description:P15145
Residue:963
BDBM50087090
NameBDBM50087090
Synonyms:C-({2-[(Carboxy-phenyl-methyl)-carbamoyl]-3-phenyl-propyl}-hydroxy-phosphinoyl)-C-phenyl-methyl-ammonium
TypeSmall organic molecule
Emp. Form.C25H28N2O5P
Mol. Mass.467.4734
SMILES[NH3+]C(c1ccccc1)P(O)(=O)C[C@@H](Cc1ccccc1)C(=O)N[C@H](C(O)=O)c1ccccc1