Reaction Details
TargetGamma-aminobutyric acid receptor subunit rho-1
LigandBDBM23183
Substrate/Competitorn/a
Meas. Tech.ChEMBL_68582 (CHEMBL679669)
Kd 2300±n/a nM
Citation Chebib, MJohnston, GA GABA-Activated ligand gated ion channels: medicinal chemistry and molecular biology. J Med Chem43:1427-47 (2000) Gamma-aminobutyric acid receptor subunit rho-1
Name:Gamma-aminobutyric acid receptor subunit rho-1
Type:PROTEIN
Mol. Mass.:55892.34
Organism:Homo sapiens (Human)
Description:ChEMBL_1456653
Residue:479
BDBM23183
NameBDBM23183
Synonyms:5-(aminomethyl)-1,2-oxazol-3-ol CHEMBL273481 Pantherine
TypeGABA Agonist
Emp. Form.C4H6N2O2
Mol. Mass.114.1026
SMILESNCc1cc(=O)[nH]o1