Reaction Details
TargetE-selectin
LigandBDBM50408284
Substrate/Competitorn/a
Meas. Tech.ChEMBL_199877 (CHEMBL803778)
IC50 280000±n/a nM
Citation Hiramatsu, YTsukida, TNakai, YInoue, YKondo, H Study on selectin blocker. 8. Lead discovery of a non-sugar antagonist using a 3D-pharmacophore model. J Med Chem43:1476-83 (2000) E-selectin
Name:E-selectin
Type:PROTEIN
Mol. Mass.:66749.86
Organism:Mus musculus
Description:ChEMBL_199837
Residue:612
BDBM50408284
NameBDBM50408284
Synonyms:CHEMBL2029056
TypeSmall organic molecule
Emp. Form.C48H91O18S
Mol. Mass.988.291
(CCCCCCCCCCCCCC)CO[C@@H]1O[C@H](CO)[C@@H](O[C@@H]2O[C@H](CO)[C@H](O)[C@H](OS([O-])(=O)=O)[C@H]2O)[C@H](O[C@@H]2O[C@@H](C)[C@@H](O)[C@@H](O)[C@@H]2O)[C@H]1O