Reaction Details
TargetKappa-type opioid receptor
LigandBDBM50087457
Substrate/Competitorn/a
Meas. Tech.ChEMBL_145421 (CHEMBL747232)
Ki>1000±n/a nM
Citation Larson, DLJones, RMHjorth, SASchwartz, TWPortoghese, PS Binding of norbinaltorphimine (norBNI) congeners to wild-type and mutant mu and kappa opioid receptors: molecular recognition loci for the pharmacophore and address components of kappa antagonists. J Med Chem43:1573-6 (2000) Kappa-type opioid receptor
Name:Kappa-type opioid receptor
Type:G Protein-Coupled Receptor (GPCR)
Mol. Mass.:42648.76
Organism:Homo sapiens (Human)
Description:P41145
Residue:380
BDBM50087457
NameBDBM50087457
Synonyms:17-Methyl-17'-cyclopropylmethyl-3'-methoxy-6,6',7,7'-tetradehydro-4,5 alpha : 4',5' alpha-diepoxy-6,6'-(imino)[7,7'-bimorphinan]-3,14,14'-triol
TypeSmall organic molecule
Emp. Form.C38H41N3O6
Mol. Mass.635.7486
SMILESCOc1ccc2CC3N(CC4CC4)CC[C@@]45[C@@H](Oc1c24)c1[nH]c2[C@@H]4Oc6c7c(CC8N(C)CC[C@@]47[C@@]8(O)Cc2c1C[C@@]35O)ccc6O