Reaction Details
TargetKappa-type opioid receptor
LigandBDBM50018790
Substrate/Competitorn/a
Meas. Tech.ChEMBL_145422 (CHEMBL747233)
Ki>1000±n/a nM
Citation Larson, DLJones, RMHjorth, SASchwartz, TWPortoghese, PS Binding of norbinaltorphimine (norBNI) congeners to wild-type and mutant mu and kappa opioid receptors: molecular recognition loci for the pharmacophore and address components of kappa antagonists. J Med Chem43:1573-6 (2000) Kappa-type opioid receptor
Name:Kappa-type opioid receptor
Type:G Protein-Coupled Receptor (GPCR)
Mol. Mass.:42648.76
Organism:Homo sapiens (Human)
Description:P41145
Residue:380
BDBM50018790
NameBDBM50018790
Synonyms:17,17'-Dimethyl-6,6',7,7'-tetradehydro-4,5:4',5'-diepoxy-6,6'-(imino)[7,7'-bimorphinan]-3,3',14,14'-tetrol
TypeSmall organic molecule
Emp. Form.C34H35N3O6
Mol. Mass.581.6582
SMILESCN1CC[C@@]23[C@H]4Oc5c2c(CC1[C@]3(O)Cc1c4[nH]c2[C@@H]3Oc4c6c(C[C@H]7N(C)CC[C@@]36[C@@]7(O)Cc12)ccc4O)ccc5O