Reaction Details
TargetKappa-type opioid receptor
LigandBDBM50087459
Substrate/Competitorn/a
Meas. Tech.ChEMBL_145422 (CHEMBL747233)
Ki 104±n/a nM
Citation Larson, DLJones, RMHjorth, SASchwartz, TWPortoghese, PS Binding of norbinaltorphimine (norBNI) congeners to wild-type and mutant mu and kappa opioid receptors: molecular recognition loci for the pharmacophore and address components of kappa antagonists. J Med Chem43:1573-6 (2000) Kappa-type opioid receptor
Name:Kappa-type opioid receptor
Type:G Protein-Coupled Receptor (GPCR)
Mol. Mass.:42648.76
Organism:Homo sapiens (Human)
Description:P41145
Residue:380
BDBM50087459
NameBDBM50087459
Synonyms:17-cyclopropylmethyl-17'-acetyl-3'-hydroxy-6,6',7,7'-tetradehydro-4,5 alpha : 4',5' alpha-diepoxy-6,6'-(imino)[7,7'-bimorphinan]-3,3',14,14'-tetrol
TypeSmall organic molecule
Emp. Form.C38H39N3O7
Mol. Mass.649.7322
SMILESCC(=O)N1CC[C@@]23[C@H]4Oc5c2c(CC1[C@]3(O)Cc1c2C[C@@]3(O)C6Cc7ccc(O)c8O[C@@H](c2[nH]c41)[C@]3(CCN6CC1CC1)c78)ccc5O