Reaction Details
TargetMu-type opioid receptor
LigandBDBM50087460
Substrate/Competitorn/a
Meas. Tech.ChEMBL_148371 (CHEMBL757366)
Ki 276±n/a nM
Citation Larson, DLJones, RMHjorth, SASchwartz, TWPortoghese, PS Binding of norbinaltorphimine (norBNI) congeners to wild-type and mutant mu and kappa opioid receptors: molecular recognition loci for the pharmacophore and address components of kappa antagonists. J Med Chem43:1573-6 (2000) Mu-type opioid receptor
Name:Mu-type opioid receptor
Type:G Protein-Coupled Receptor (GPCR)
Mol. Mass.:44789.51
Organism:Homo sapiens (Human)
Description:P35372
Residue:400
BDBM50087460
NameBDBM50087460
Synonyms:17-cyclopropylmethyl-17'-cyclopropylmethyl-3'-hydroxy-3-methoxy-6,6',7,7'-tetradehydro-4,5 alpha : 4',5' alpha-diepoxy-6,6'-(imino)[7,7'-bimorphinan]-14,14'-diol
TypeSmall organic molecule
Emp. Form.C41H45N3O6
Mol. Mass.675.8125
SMILESCOc1ccc2CC3N(CC4CC4)CC[C@@]45[C@@H](Oc1c24)c1[nH]c2[C@@H]4Oc6c7c(CC8N(CC9CC9)CC[C@@]47[C@@]8(O)Cc2c1C[C@@]35O)ccc6O