Reaction Details
TargetKappa-type opioid receptor
LigandBDBM50001714
Substrate/Competitorn/a
Meas. Tech.ChEMBL_145421 (CHEMBL747232)
Ki 0.38±n/a nM
Citation Larson, DLJones, RMHjorth, SASchwartz, TWPortoghese, PS Binding of norbinaltorphimine (norBNI) congeners to wild-type and mutant mu and kappa opioid receptors: molecular recognition loci for the pharmacophore and address components of kappa antagonists. J Med Chem43:1573-6 (2000) Kappa-type opioid receptor
Name:Kappa-type opioid receptor
Type:G Protein-Coupled Receptor (GPCR)
Mol. Mass.:42648.76
Organism:Homo sapiens (Human)
Description:P41145
Residue:380
BDBM50001714
NameBDBM50001714
Synonyms:2-[3-cyclopropylmethyl-11-hydroxy-15-methoxy-(1S,2R,6S,14R,15R,16R)-13-oxa-3-azahexacyclo[13.2.2.12,8.01,6.06,14.07,12]icosa-7,9,11-trien-16-yl]-2-propanol 2-[3-cyclopropylmethyl-11-hydroxy-15-methoxy-13-oxa-3-azahexacyclo[13.2.2.12,8.01,6.06,14.07,12]icosa-7(12),8,10-trien-16-yl]-2-propanol DIPRENORPHINE-HCl | Diprenorphine
TypeSmall organic molecule
Emp. Form.C26H35NO4
Mol. Mass.425.5604
SMILESCO[C@]12CC[C@@]3(C[C@@H]1C(C)(C)O)[C@H]1Cc4ccc(O)c5O[C@@H]2[C@]3(CCN1CC1CC1)c45