Reaction Details
TargetSodium/glucose cotransporter 1
LigandBDBM23446
Substrate/Competitorn/a
Meas. Tech.ChEMBL_202730 (CHEMBL809058)
Ki 86000±n/a nM
Citation Wielert-Badt, SLin, JTLorenz, MFritz, SKinne, RK Probing the conformation of the sugar transport inhibitor phlorizin by 2D-NMR, molecular dynamics studies, and pharmacophore analysis. J Med Chem43:1692-8 (2000) Sodium/glucose cotransporter 1
Name:Sodium/glucose cotransporter 1
Type:Protein
Mol. Mass.:73503.78
Organism:Homo sapiens (Human)
Description:P13866
Residue:664
BDBM23446
NameBDBM23446
Synonyms:3-(4-hydroxyphenyl)-1-(2,4,6-trihydroxyphenyl)propan-1-one Phloretin | cid_4788
TypeDihydrochalcone
Emp. Form.C15H14O5
Mol. Mass.274.2687
SMILESOc1ccc(CCC(=O)c2c(O)cc(O)cc2O)cc1