Reaction Details
TargetSodium/glucose cotransporter 1
LigandBDBM50422346
Substrate/Competitorn/a
Meas. Tech.ChEMBL_202730 (CHEMBL809058)
Ki 23100±n/a nM
Citation Wielert-Badt, SLin, JTLorenz, MFritz, SKinne, RK Probing the conformation of the sugar transport inhibitor phlorizin by 2D-NMR, molecular dynamics studies, and pharmacophore analysis. J Med Chem43:1692-8 (2000) Sodium/glucose cotransporter 1
Name:Sodium/glucose cotransporter 1
Type:Protein
Mol. Mass.:73503.78
Organism:Homo sapiens (Human)
Description:P13866
Residue:664
BDBM50422346
NameBDBM50422346
Synonyms:CHEMBL2303991
TypeSmall organic molecule
Emp. Form.C21H21Br3O10
Mol. Mass.673.097
SMILESOC[C@@H]1O[C@@H](Oc2cc(O)c(Br)c(O)c2C(=O)CCc2cc(Br)c(O)c(Br)c2)[C@@H](O)[C@@H](O)[C@@H]1O