Reaction Details
TargetSodium/glucose cotransporter 1
LigandBDBM50422350
Substrate/Competitorn/a
Meas. Tech.ChEMBL_202730 (CHEMBL809058)
Ki 5300±n/a nM
Citation Wielert-Badt, SLin, JTLorenz, MFritz, SKinne, RK Probing the conformation of the sugar transport inhibitor phlorizin by 2D-NMR, molecular dynamics studies, and pharmacophore analysis. J Med Chem43:1692-8 (2000) Sodium/glucose cotransporter 1
Name:Sodium/glucose cotransporter 1
Type:Protein
Mol. Mass.:73503.78
Organism:Homo sapiens (Human)
Description:P13866
Residue:664
BDBM50422350
NameBDBM50422350
Synonyms:CHEMBL2303987
TypeSmall organic molecule
Emp. Form.C28H28N2O12
Mol. Mass.584.5281
SMILESOC[C@@H]1O[C@@H](Oc2cc(O)cc(O)c2C(=O)CCc2ccc(O)c(c2)N=Cc2ccc(cc2)[N+]([O-])=O)[C@@H](O)[C@@H](O)[C@@H]1O