Reaction Details
TargetSodium/glucose cotransporter 1
LigandBDBM50422353
Substrate/Competitorn/a
Meas. Tech.ChEMBL_202730 (CHEMBL809058)
Ki 2800±n/a nM
Citation Wielert-Badt, SLin, JTLorenz, MFritz, SKinne, RK Probing the conformation of the sugar transport inhibitor phlorizin by 2D-NMR, molecular dynamics studies, and pharmacophore analysis. J Med Chem43:1692-8 (2000) Sodium/glucose cotransporter 1
Name:Sodium/glucose cotransporter 1
Type:Protein
Mol. Mass.:73503.78
Organism:Homo sapiens (Human)
Description:P13866
Residue:664
BDBM50422353
NameBDBM50422353
Synonyms:CHEMBL2303988
TypeSmall organic molecule
Emp. Form.C22H26O10
Mol. Mass.450.4358
SMILESCOc1ccc(CCC(=O)c2c(O)cc(O)cc2O[C@@H]2O[C@@H](CO)[C@@H](O)[C@H](O)[C@@H]2O)cc1