Reaction Details
TargetSodium/glucose cotransporter 1
LigandBDBM50422356
Substrate/Competitorn/a
Meas. Tech.ChEMBL_202730 (CHEMBL809058)
Ki 45000±n/a nM
Citation Wielert-Badt, SLin, JTLorenz, MFritz, SKinne, RK Probing the conformation of the sugar transport inhibitor phlorizin by 2D-NMR, molecular dynamics studies, and pharmacophore analysis. J Med Chem43:1692-8 (2000) Sodium/glucose cotransporter 1
Name:Sodium/glucose cotransporter 1
Type:Protein
Mol. Mass.:73503.78
Organism:Homo sapiens (Human)
Description:P13866
Residue:664
BDBM50422356
NameBDBM50422356
Synonyms:CHEMBL2303983
TypeSmall organic molecule
Emp. Form.C22H26O10
Mol. Mass.450.4358
SMILESCO[C@H]1[C@H](O)[C@H](CO)O[C@@H](Oc2cc(O)cc(O)c2C(=O)CCc2ccc(O)cc2)[C@H]1O