Reaction Details
TargetKappa-type opioid receptor
LigandBDBM50369821
Substrate/Competitorn/a
Meas. Tech.ChEMBL_146365 (CHEMBL882421)
Ki 0.800000±n/a nM
Citation Coop, ANorton, CLBerzetei-Gurske, IBurnside, JToll, LHusbands, SMLewis, JW Structural determinants of opioid activity in the orvinols and related structures: ethers of orvinol and isoorvinol. J Med Chem43:1852-7 (2000) Kappa-type opioid receptor
Name:Kappa-type opioid receptor
Type:G Protein-Coupled Receptor (GPCR)
Mol. Mass.:42744.99
Organism:Cavia porcellus (domestic guinea pig)
Description:P41144
Residue:380
BDBM50369821
NameBDBM50369821
Synonyms:CHEMBL1169585
TypeSmall organic molecule
Emp. Form.C25H33NO4
Mol. Mass.411.5338
SMILESCCC[C@@](C)(O)[C@@H]1CC23C=C[C@]1(OC)[C@H]1Oc4c5c(CC2N(C)CCC315)ccc4O