Reaction Details
TargetMu-type opioid receptor
LigandBDBM50026890
Substrate/Competitorn/a
Meas. Tech.ChEMBL_145581 (CHEMBL749726)
EC50 4.9±n/a nM
Citation Coop, ANorton, CLBerzetei-Gurske, IBurnside, JToll, LHusbands, SMLewis, JW Structural determinants of opioid activity in the orvinols and related structures: ethers of orvinol and isoorvinol. J Med Chem43:1852-7 (2000) Mu-type opioid receptor
Name:Mu-type opioid receptor
Type:G Protein-Coupled Receptor (GPCR)
Mol. Mass.:44789.51
Organism:Homo sapiens (Human)
Description:P35372
Residue:400
BDBM50026890
NameBDBM50026890
Synonyms:CHEMBL2113670
TypeSmall organic molecule
Emp. Form.C24H31NO4
Mol. Mass.397.5072
SMILES[H][C@](C)(OCC)[C@]1([H])C[C@]23C=C[C@]1(OC)[C@@]1([H])Oc4c5c(C[C@@]2([H])N(C)CCC315)ccc4O