Reaction Details
TargetDelta-type opioid receptor
LigandBDBM50026889
Substrate/Competitorn/a
Meas. Tech.ChEMBL_145471 (CHEMBL751258)
Ki 4.6±n/a nM
Citation Coop, ANorton, CLBerzetei-Gurske, IBurnside, JToll, LHusbands, SMLewis, JW Structural determinants of opioid activity in the orvinols and related structures: ethers of orvinol and isoorvinol. J Med Chem43:1852-7 (2000) Delta-type opioid receptor
Name:Delta-type opioid receptor
Type:G Protein-Coupled Receptor (GPCR)
Mol. Mass.:40382.98
Organism:Homo sapiens (Human)
Description:Competition binding assays were carried out using membrane preparations from transfected HN9.10 cells that constitutively expressed the delta opioid receptor.
Residue:372
BDBM50026889
NameBDBM50026889
Synonyms:CHEMBL2113672
TypeSmall organic molecule
Emp. Form.C29H33NO4
Mol. Mass.459.5766
SMILES[H][C@@](C)(OCc1ccccc1)[C@]1([H])C[C@]23C=C[C@]1(OC)[C@@]1([H])Oc4c5c(C[C@@]2([H])N(C)CCC315)ccc4O