Reaction Details
TargetIntermediate conductance calcium-activated potassium channel protein 4/Potassium voltage-gated channel subfamily E member 1/Potassium voltage-gated channel subfamily KQT member 1
LigandBDBM50099566
Substrate/Competitorn/a
Meas. Tech.ChEMBL_71494 (CHEMBL680747)
IC50 9±n/a nM
Citation Coghlan, MJCarroll, WAGopalakrishnan, M Recent developments in the biology and medicinal chemistry of potassium channel modulators: update from a decade of progress. J Med Chem44:1627-53 (2001) Intermediate conductance calcium-activated potassium channel protein 4/Potassium voltage-gated channel subfamily E member 1/Potassium voltage-gated channel subfamily KQT member 1
Name:Intermediate conductance calcium-activated potassium channel protein 4/Potassium voltage-gated channel subfamily E member 1/Potassium voltage-gated channel subfamily KQT member 1
Synonyms:Intermediate conductance calcium-activated potassium channel protein 4/Voltage-gated potassium channel beta subunit Mink/Voltage-gated potassium channel subunit Kv7.1
Type:n/a
Mol. Mass.:n/a
Description:ASSAY_ID of EBI is 71494
Components:This complex has 3 components.
Component 1
Name:Potassium voltage-gated channel subfamily E member 1
Type:PROTEIN
Mol. Mass.:14676.11
Organism:Homo sapiens (Human)
Description:ChEMBL_1456351
Residue:129
Component 2
Name:Intermediate conductance calcium-activated potassium channel protein 4
Synonyms:IK1 KCA4 KCNN4_HUMAN SK4
Type:PROTEIN
Mol. Mass.:47723.22
Organism:Homo sapiens (Human)
Description:ChEMBL_1361891
Residue:427
Component 3
Name:Potassium voltage-gated channel subfamily KQT member 1
Synonyms:KCNA8 KCNQ (Kv7) potassium channel KCNQ1_HUMAN Voltage-gated potassium channel subunit Kv7.1 | Voltage-gated potassium channel subunit Kv7.1/Misshapen-like kinase 1
Type:PROTEIN
Mol. Mass.:74739.00
Organism:Homo sapiens (Human)
Description:ChEMBL_1454245
Residue:676
BDBM50099566
NameBDBM50099566
Synonyms:(2-fluorophenyl)-(4-fluorophenyl)phenylacetamide CHEMBL42205
TypeSmall organic molecule
Emp. Form.C20H15F2NO
Mol. Mass.323.336
SMILESNC(=O)C(c1ccccc1)(c1ccc(F)cc1)c1ccccc1F