Reaction Details
TargetPotassium voltage-gated channel subfamily E/KQT member 1
LigandBDBM50099582
Substrate/Competitorn/a
Meas. Tech.ChEMBL_86621 (CHEMBL699347)
IC50 120±n/a nM
Citation Coghlan, MJCarroll, WAGopalakrishnan, M Recent developments in the biology and medicinal chemistry of potassium channel modulators: update from a decade of progress. J Med Chem44:1627-53 (2001) Potassium voltage-gated channel subfamily E/KQT member 1
Name:Potassium voltage-gated channel subfamily E/KQT member 1
Type:n/a
Mol. Mass.:n/a
Description:ASSAY_ID of EBI is 158552
Components:This complex has 2 components.
Component 1
Name:Potassium voltage-gated channel subfamily E member 1
Synonyms:Delayed rectifier potassium channel subunit IsK KCNE1 KCNQ1(Kv7.1)/KCNE1(MinK) Voltage-gated potassium channel beta subunit Mink | Voltage-gated potassium channel, IKs
Type:PROTEIN
Mol. Mass.:14676.11
Organism:Homo sapiens (Human)
Description:ChEMBL_1456351
Residue:129
Component 2
Name:Potassium voltage-gated channel subfamily KQT member 1
Synonyms:KCNA8 KCNQ (Kv7) potassium channel KCNQ1_HUMAN Voltage-gated potassium channel subunit Kv7.1 | Voltage-gated potassium channel subunit Kv7.1/Misshapen-like kinase 1
Type:PROTEIN
Mol. Mass.:74739.00
Organism:Homo sapiens (Human)
Description:ChEMBL_1454245
Residue:676
BDBM50099582
NameBDBM50099582
Synonyms:(3R,4S)N-[3-Hydroxy-2,2-dimethyl-6-(4,4,4-trifluoro-butoxy)-chroman-4-yl]-N-methyl-methanesulfonamide N-[(3R,4S)-3-Hydroxy-2,2-dimethyl-6-(4,4,4-trifluoro-butoxy)-chroman-4-yl]-N-methyl-methanesulfonamide | N-[3-Hydroxy-2,2-dimethyl-6-(4,4,4-trifluoro-butoxy)-chroman-4-yl]-N-methyl-methanesulfonamide
TypeSmall organic molecule
Emp. Form.C17H24F3NO5S
Mol. Mass.411.436
SMILESCN([C@@H]1[C@@H](O)C(C)(C)Oc2ccc(OCCCC(F)(F)F)cc12)S(C)(=O)=O