Reaction Details
TargetHistamine H3 receptor
LigandBDBM50099622
Substrate/Competitorn/a
Meas. Tech.ChEMBL_86747 (CHEMBL694088)
Ki 0.4±n/a nM
Citation De Esch, IJMills, JEPerkins, TDRomeo, GHoffmann, MWieland, KLeurs, RMenge, WMNederkoorn, PHDean, PMTimmerman, H Development of a pharmacophore model for histamine H3 receptor antagonists, using the newly developed molecular modeling program SLATE. J Med Chem44:1666-74 (2001) Histamine H3 receptor
Name:Histamine H3 receptor
Type:G Protein-Coupled Receptor (GPCR)
Mol. Mass.:48607.98
Organism:Rattus norvegicus (rat)
Description:n/a
Residue:445
BDBM50099622
NameBDBM50099622
Synonyms:1-Cyclohexylmethyl-3-[2-(1H-imidazol-4-yl)-cyclopropyl]-allyl-ammonium
TypeSmall organic molecule
Emp. Form.C16H26N3
Mol. Mass.260.3972
SMILES[NH3+]C(CC1CCCCC1)C=CC1CC1c1cnc[nH]1