Reaction Details
TargetHistamine H3 receptor
LigandBDBM50099624
Substrate/Competitorn/a
Meas. Tech.ChEMBL_86747 (CHEMBL694088)
Ki 14±n/a nM
Citation De Esch, IJMills, JEPerkins, TDRomeo, GHoffmann, MWieland, KLeurs, RMenge, WMNederkoorn, PHDean, PMTimmerman, H Development of a pharmacophore model for histamine H3 receptor antagonists, using the newly developed molecular modeling program SLATE. J Med Chem44:1666-74 (2001) Histamine H3 receptor
Name:Histamine H3 receptor
Type:G Protein-Coupled Receptor (GPCR)
Mol. Mass.:48607.98
Organism:Rattus norvegicus (rat)
Description:n/a
Residue:445
BDBM50099624
NameBDBM50099624
Synonyms:(4-Chloro-phenyl)-acetic acid 3-(1H-imidazol-4-yl)-propyl ester | CHEMBL45370
TypeSmall organic molecule
Emp. Form.C14H15ClN2O2
Mol. Mass.278.734
SMILESClc1ccc(CC(=O)OCCCc2cnc[nH]2)cc1