Reaction Details
TargetHistamine H3 receptor
LigandBDBM50407372
Substrate/Competitorn/a
Meas. Tech.ChEMBL_83467 (CHEMBL693938)
Kd 10±n/a nM
Citation De Esch, IJMills, JEPerkins, TDRomeo, GHoffmann, MWieland, KLeurs, RMenge, WMNederkoorn, PHDean, PMTimmerman, H Development of a pharmacophore model for histamine H3 receptor antagonists, using the newly developed molecular modeling program SLATE. J Med Chem44:1666-74 (2001) Histamine H3 receptor
Name:Histamine H3 receptor
Type:Enzyme Catalytic Domain
Mol. Mass.:48753.61
Organism:GUINEA PIG
Description:HISTAMINE H3 HRH3 GUINEA PIG::Q9JI35
Residue:445
BDBM50407372
NameBDBM50407372
Synonyms:CHEMBL44220
TypeSmall organic molecule
Emp. Form.C10H18N4S
Mol. Mass.226.342
SMILESCNC(=S)NCCCCCc1cnc[nH]1