Reaction Details
TargetHistamine H3 receptor
LigandBDBM85830
Substrate/Competitorn/a
Meas. Tech.ChEMBL_83467 (CHEMBL693938)
Kd 1.26±n/a nM
Citation De Esch, IJMills, JEPerkins, TDRomeo, GHoffmann, MWieland, KLeurs, RMenge, WMNederkoorn, PHDean, PMTimmerman, H Development of a pharmacophore model for histamine H3 receptor antagonists, using the newly developed molecular modeling program SLATE. J Med Chem44:1666-74 (2001) Histamine H3 receptor
Name:Histamine H3 receptor
Type:Enzyme Catalytic Domain
Mol. Mass.:48753.61
Organism:GUINEA PIG
Description:HISTAMINE H3 HRH3 GUINEA PIG::Q9JI35
Residue:445
BDBM85830
NameBDBM85830
Synonyms:VUF5202
TypeSmall organic molecule
Emp. Form.C15H20ClN3
Mol. Mass.277.792
SMILESClc1ccc(CNCCCCCc2cnc[nH]2)cc1