Reaction Details
TargetProtein kinase C delta type
LigandBDBM50099645
Substrate/Competitorn/a
Meas. Tech.ChEMBL_153143 (CHEMBL759082)
Ki 2.71±n/a nM
Citation Pak, YEnyedy, IJVarady, JKung, JWLorenzo, PSBlumberg, PMWang, S Structural basis of binding of high-affinity ligands to protein kinase C: prediction of the binding modes through a new molecular dynamics method and evaluation by site-directed mutagenesis. J Med Chem44:1690-701 (2001) Protein kinase C delta type
Name:Protein kinase C delta type
Type:PROTEIN
Mol. Mass.:77554.99
Organism:Mus musculus
Description:ChEMBL_1351519
Residue:674
BDBM50099645
NameBDBM50099645
Synonyms:CHEMBL49689 | Thymeleatoxin
TypeSmall organic molecule
Emp. Form.C36H36O10
Mol. Mass.628.665
SMILESC[C@@H]1[C@@H](OC(=O)\C=C\c2ccccc2)[C@@]2(OC3(O[C@@H]2[C@@H]2C4O[C@]4(CO)[C@@H](O)[C@@]4(O)[C@@H](C=C(C)C4=O)[C@@]12O3)c1ccccc1)C(C)=C