Reaction Details
TargetProtein kinase C alpha type
LigandBDBM50100125
Substrate/Competitorn/a
Meas. Tech.ChEMBL_153127 (CHEMBL759066)
Ki 24.6±n/a nM
Citation Nacro, KSigano, DMYan, SNicklaus, MCPearce, LLLewin, NEGarfield, SHBlumberg, PMMarquez, VE An optimized protein kinase C activating diacylglycerol combining high binding affinity (Ki) with reduced lipophilicity (log P). J Med Chem44:1892-904 (2001) Protein kinase C alpha type
Name:Protein kinase C alpha type
Type:Enzyme
Mol. Mass.:76842.76
Organism:Bos taurus (bovine)
Description:n/a
Residue:672
BDBM50100125
NameBDBM50100125
Synonyms:3-Isopropyl-4-methyl-pent-2-enoic acid 3-hydroxy-2-(3-isopropyl-4-methyl-pentanoyloxy)-propyl ester | CHEMBL294422
TypeSmall organic molecule
Emp. Form.C21H38O5
Mol. Mass.370.5234
SMILES[#6]-[#6](-[#6])-[#6](-[#6]-[#6](=O)-[#8]-[#6@@H](-[#6]-[#8])-[#6]-[#8]-[#6](=O)\[#6]=[#6](/[#6](-[#6])-[#6])-[#6](-[#6])-[#6])-[#6](-[#6])-[#6]