Reaction Details
TargetGlyceraldehyde-3-phosphate dehydrogenase
LigandBDBM50100470
Substrate/Competitorn/a
Meas. Tech.ChEMBL_72892 (CHEMBL684059)
IC50 7000±n/a nM
Citation Bressi, JCVerlinde, CLAronov, AMShaw, MLShin, SSNguyen, LNSuresh, SBuckner, FSVan Voorhis, WCKuntz, IDHol, WGGelb, MH Adenosine analogues as selective inhibitors of glyceraldehyde-3-phosphate dehydrogenase of Trypanosomatidae via structure-based drug design. J Med Chem44:2080-93 (2001) Glyceraldehyde-3-phosphate dehydrogenase
Name:Glyceraldehyde-3-phosphate dehydrogenase
Type:PROTEIN
Mol. Mass.:36060.86
Organism:Homo sapiens (Human)
Description:ChEMBL_1511315
Residue:335
BDBM50100470
NameBDBM50100470
Synonyms:CHEMBL303595 | N-(4-Hydroxy-5-hydroxymethyl-2-{6-[(naphthalen-1-ylmethyl)-amino]-9H-purin-3-ylmethyl}-tetrahydro-furan-3-yl)-3,4-dimethoxy-benzamide
TypeSmall organic molecule
Emp. Form.C30H30N6O6
Mol. Mass.570.5958
SMILESCOc1ccc(cc1OC)C(=O)N[C@@H]1[C@H](O)[C@@H](CO)O[C@H]1n1cnc2c(NCc3cccc4ccccc34)ncnc12