Reaction Details
TargetcGMP-specific 3',5'-cyclic phosphodiesterase
LigandBDBM50100673
Substrate/Competitorn/a
Meas. Tech.ChEMBL_154560 (CHEMBL757895)
IC50 0.220000±n/a nM
Citation Ukita, TNakamura, YKubo, AYamamoto, YMoritani, YSaruta, KHigashijima, TKotera, JTakagi, MKikkawa, KOmori, K Novel, potent, and selective phosphodiesterase 5 inhibitors: synthesis and biological activities of a series of 4-aryl-1-isoquinolinone derivatives. J Med Chem44:2204-18 (2001) cGMP-specific 3',5'-cyclic phosphodiesterase
Name:cGMP-specific 3',5'-cyclic phosphodiesterase
Type:PROTEIN
Mol. Mass.:98285.03
Organism:Canis lupus familiaris
Description:ChEMBL_105565
Residue:865
BDBM50100673
NameBDBM50100673
Synonyms:CHEMBL538498 | methyl 2-(4-aminophenyl)-4-(4-bromo-3,5-dimethoxyphenyl)-1-oxo-7-(2-pyridylmethoxy)-1,2-dihydro-3-isoquinolinecarboxylate.dihydrochloride
TypeSmall organic molecule
Emp. Form.C31H26BrN3O6
Mol. Mass.616.459
SMILESCOC(=O)c1c(-c2cc(OC)c(Br)c(OC)c2)c2ccc(OCc3ccccn3)cc2c(=O)n1-c1ccc(N)cc1