Reaction Details
TargetDual specificity calcium/calmodulin-dependent 3',5'-cyclic nucleotide phosphodiesterase 1B/Dual specificity calcium/calmodulin-dependent 3',5'-cyclic nucleotide phosphodiesterase 1C/Phosphodiesterase
LigandBDBM50100683
Substrate/Competitorn/a
Meas. Tech.ChEMBL_154419 (CHEMBL758018)
IC50>10000±n/a nM
Citation Ukita, TNakamura, YKubo, AYamamoto, YMoritani, YSaruta, KHigashijima, TKotera, JTakagi, MKikkawa, KOmori, K Novel, potent, and selective phosphodiesterase 5 inhibitors: synthesis and biological activities of a series of 4-aryl-1-isoquinolinone derivatives. J Med Chem44:2204-18 (2001) Dual specificity calcium/calmodulin-dependent 3',5'-cyclic nucleotide phosphodiesterase 1B/Dual specificity calcium/calmodulin-dependent 3',5'-cyclic nucleotide phosphodiesterase 1C/Phosphodiesterase
Name:Dual specificity calcium/calmodulin-dependent 3',5'-cyclic nucleotide phosphodiesterase 1B/Dual specificity calcium/calmodulin-dependent 3',5'-cyclic nucleotide phosphodiesterase 1C/Phosphodiesterase
Type:n/a
Mol. Mass.:n/a
Description:ASSAY_ID of ChEMBL is 154419
Components:This complex has 3 components.
Component 1
Name:Dual specificity calcium/calmodulin-dependent 3',5'-cyclic nucleotide phosphodiesterase 1C
Synonyms:Calcium/calmodulin-dependent 3',5'-cyclic nucleotide phosphodiesterase 1C Dual specificity Calcium/calmodulin-dependent 3',5'-cyclic nucleotide phosphodiesterase 1C Pde1c | Pde1c2
Type:PROTEIN
Mol. Mass.:86691.70
Organism:Rattus norvegicus
Description:ChEMBL_105015
Residue:768
Component 2
Name:Phosphodiesterase
Synonyms:Pde1a | Phosphodiesterase 1A
Type:PROTEIN
Mol. Mass.:61851.57
Organism:Rattus norvegicus
Description:ChEMBL_105015
Residue:542
Component 3
Name:Dual specificity calcium/calmodulin-dependent 3',5'-cyclic nucleotide phosphodiesterase 1B
Synonyms:63 kDa Cam-PDE PDE1B_RAT Pde1b1 | Phosphodiesterase 1
Type:PROTEIN
Mol. Mass.:61248.78
Organism:Rattus norvegicus
Description:ChEMBL_105015
Residue:535
BDBM50100683
NameBDBM50100683
Synonyms:2-(4-aminophenyl)-1-oxo-7-(2-pyridylmethoxy)-4-(3,4,5-trimethoxyphenyl)-1,2-dihydro-3-isoquinolinecarboxylic acid.dihydrochloride | CHEMBL544057
TypeSmall organic molecule
Emp. Form.C31H27N3O7
Mol. Mass.553.562
SMILESCOc1cc(cc(OC)c1OC)-c1c(C(O)=O)n(-c2ccc(N)cc2)c(=O)c2cc(OCc3ccccn3)ccc12