Reaction Details
TargetMatrilysin
LigandBDBM30359
Substrate/Competitorn/a
Meas. Tech.ChEMBL_105037 (CHEMBL711551)
IC50 3660±n/a nM
Citation Pikul, SOhler, NECiszewski, GLaufersweiler, MCAlmstead, NGDe, BNatchus, MGHsieh, LCJanusz, MJPeng, SXBranch, TMKing, SLTaiwo, YOMieling, GE Potent and selective carboxylic acid-based inhibitors of matrix metalloproteinases. J Med Chem44:2499-502 (2001) Matrilysin
Name:Matrilysin
Type:Enzyme
Mol. Mass.:29681.54
Organism:Homo sapiens (Human)
Description:P09237
Residue:267
BDBM30359
NameBDBM30359
Synonyms:BOC-piperidinyl glycine derivative, 34
TypeSmall organic molecule
Emp. Form.C25H32N2O7S
Mol. Mass.504.596
SMILESCOc1ccc(cc1)-c1ccc(cc1)S(=O)(=O)N[C@H](C1CCN(CC1)C(=O)OC(C)(C)C)C(O)=O