Reaction Details
TargetInterstitial collagenase
LigandBDBM30359
Substrate/Competitorn/a
Meas. Tech.ChEMBL_105963 (CHEMBL878467)
IC50 1370±n/a nM
Citation Pikul, SOhler, NECiszewski, GLaufersweiler, MCAlmstead, NGDe, BNatchus, MGHsieh, LCJanusz, MJPeng, SXBranch, TMKing, SLTaiwo, YOMieling, GE Potent and selective carboxylic acid-based inhibitors of matrix metalloproteinases. J Med Chem44:2499-502 (2001) Interstitial collagenase
Name:Interstitial collagenase
Type:Enzyme
Mol. Mass.:54010.26
Organism:Homo sapiens (Human)
Description: P03956
Residue:469
BDBM30359
NameBDBM30359
Synonyms:BOC-piperidinyl glycine derivative, 34
TypeSmall organic molecule
Emp. Form.C25H32N2O7S
Mol. Mass.504.596
SMILESCOc1ccc(cc1)-c1ccc(cc1)S(=O)(=O)N[C@H](C1CCN(CC1)C(=O)OC(C)(C)C)C(O)=O