Reaction Details
TargetMatrix metalloproteinase-9
LigandBDBM50102600
Substrate/Competitorn/a
Meas. Tech.ChEMBL_105380 (CHEMBL710800)
Ki 3.9±n/a nM
Citation Xue, CBVoss, MENelson, DJDuan, JJCherney, RJJacobson, ICHe, XRoderick, JChen, LCorbett, RLWang, LMeyer, DTKennedy, KDeGradodagger, WFHardman, KDTeleha, CAJaffee, BDLiu, RQCopeland, RACovington, MBChrist, DDTrzaskos, JMNewton, RCMagolda, RLWexler, RRDecicco, CP Design, synthesis, and structure-activity relationships of macrocyclic hydroxamic acids that inhibit tumor necrosis factor alpha release in vitro and in vivo. J Med Chem44:2636-60 (2001) Matrix metalloproteinase-9
Name:Matrix metalloproteinase-9
Type:Enzyme
Mol. Mass.:78452.28
Organism:Homo sapiens (Human)
Description:P14780
Residue:707
BDBM50102600
NameBDBM50102600
Synonyms:12-Isobutyl-4-methyl-3,11-dioxo-1-oxa-4,10-diaza-cyclotridecane-9,13-dicarboxylic acid 13-hydroxyamide 9-methylamide | CHEMBL92385
TypeSmall organic molecule
Emp. Form.C18H32N4O6
Mol. Mass.400.4699
SMILESCNC(=O)[C@@H]1CCCCN(C)C(=O)CO[C@@H]([C@@H](CC(C)C)C(=O)N1)C(=O)NO